Target
Sigma non-opioid intracellular receptor 1
Ligand
BDBM50036718
Substrate
Meas. Tech.
ChEBML_201714
IC50
1000±n/a nM
Citation
 Schuster, DIPan, YPSingh, GStoupakis, GCai, BLem, GEhrlich, GKFrietze, WMurphy, RB N-(1-arylpropionyl)-4-aryltetrahydropyridines, a new class of high-affinity selective sigma receptor ligands. J Med Chem 36:3923-8 (1994)  
Target
Name:
Sigma non-opioid intracellular receptor 1
Synonyms:
Aging-associated gene 8 protein SGMR1_HUMAN SIGMAR1 SR31747-binding protein Sigma 1-type opioid receptor Sigma1R | hSigmaR1
Type:
Enzyme Catalytic Domain
Mol. Mass.:
25124.85
Organism:
Homo sapiens (Human)
Description:
Q99720
Residue:
223
  
Inhibitor
Name:
BDBM50036718
Synonyms:
4-Phenyl-1,2,3,6-tetrahydro-pyridine CHEMBL1901802 EN300-17815
Type:
Small organic molecule
Emp. Form.:
C11H13N
Mol. Mass.:
159.2276
SMILES:
C1CC(=CCN1)c1ccccc1
: