Target
D(2) dopamine receptor
Ligand
BDBM50002218
Substrate
Meas. Tech.
ChEMBL_59474 (CHEMBL671727)
Ki
>1000±n/a nM
Citation
 Schuster, DIPan, YPSingh, GStoupakis, GCai, BLem, GEhrlich, GKFrietze, WMurphy, RB N-(1-arylpropionyl)-4-aryltetrahydropyridines, a new class of high-affinity selective sigma receptor ligands. J Med Chem 36:3923-8 (1994)  
Target
Name:
D(2) dopamine receptor
Synonyms:
DOPAMINE D2 DRD2_BOVIN | Dopamine D2 receptor
Type:
Enzyme Catalytic Domain
Mol. Mass.:
50698.79
Organism:
BOVINE
Description:
P20288
Residue:
444
  
Inhibitor
Name:
BDBM50002218
Synonyms:
2-(1-Cyclopropylmethyl-piperidin-4-yl)-1-(4-fluoro-phenyl)-ethanone; hydrobromide CHEMBL543412
Type:
Small organic molecule
Emp. Form.:
C17H22FNO
Mol. Mass.:
275.3611
SMILES:
Fc1ccc(cc1)C(=O)CC1CCN(CC2CC2)CC1
: