Target
D(2) dopamine receptor
Ligand
BDBM50036722
Substrate
Meas. Tech.
ChEBML_59474
IC50
>5000±n/a nM
Citation
 Schuster, DIPan, YPSingh, GStoupakis, GCai, BLem, GEhrlich, GKFrietze, WMurphy, RB N-(1-arylpropionyl)-4-aryltetrahydropyridines, a new class of high-affinity selective sigma receptor ligands. J Med Chem 36:3923-8 (1994)  
Target
Name:
D(2) dopamine receptor
Synonyms:
DOPAMINE D2 DRD2_BOVIN | Dopamine D2 receptor
Type:
Enzyme Catalytic Domain
Mol. Mass.:
50698.79
Organism:
BOVINE
Description:
P20288
Residue:
444
  
Inhibitor
Name:
BDBM50036722
Synonyms:
3-[4-(4-Fluoro-phenyl)-3,6-dihydro-2H-pyridin-1-yl]-1-phenyl-propan-1-one | CHEMBL338181
Type:
Small organic molecule
Emp. Form.:
C20H20FNO
Mol. Mass.:
309.3773
SMILES:
Fc1ccc(cc1)C1=CCN(CCC(=O)c2ccccc2)CC1
: