Target
5-hydroxytryptamine receptor 1A
Ligand
BDBM50036900
Substrate
Meas. Tech.
ChEMBL_757 (CHEMBL615859)
IC50
18±n/a nM
Citation
 Hrib, NJJurcak, JGBurgher, KLConway, PGHartman, HBKerman, LLRoehr, JEWoods, AT Benzisoxazole- and benzisothiazole-3-carboxamides as potential atypical antipsychotic agents. J Med Chem 37:2308-14 (1994)  
Target
Name:
5-hydroxytryptamine receptor 1A
Synonyms:
5-HT-1A 5-HT1A 5-hydroxytryptamine receptor 1A (5HT1A) 5ht1a Htr1a Serotonin 1a (5-HT1a) receptor/Adrenergic receptor alpha-1 | Serotonin receptor 1A
Type:
G Protein-Coupled Receptor (GPCR)
Mol. Mass.:
46445.29
Organism:
Rattus norvegicus (rat)
Description:
Binding assays were performed using rat hippocampal membranes.
Residue:
422
  
Inhibitor
Name:
BDBM50036900
Synonyms:
Benzo[d]isothiazole-3-carboxylic acid [4-(4-benzo[d]isothiazol-3-yl-piperazin-1-yl)-butyl]-amide | CHEMBL305866
Type:
Small organic molecule
Emp. Form.:
C23H25N5OS2
Mol. Mass.:
451.608
SMILES:
O=C(NCCCCN1CCN(CC1)c1nsc2ccccc12)c1nsc2ccccc12
: