Target
5-hydroxytryptamine receptor 2A
Ligand
BDBM21398
Substrate
Meas. Tech.
ChEMBL_2580 (CHEMBL882923)
IC50
129±n/a nM
Citation
 Hrib, NJJurcak, JGBurgher, KLConway, PGHartman, HBKerman, LLRoehr, JEWoods, AT Benzisoxazole- and benzisothiazole-3-carboxamides as potential atypical antipsychotic agents. J Med Chem 37:2308-14 (1994)  
Target
Name:
5-hydroxytryptamine receptor 2A
Synonyms:
5-HT-2A 5-HT2A 5-hydroxytryptamine receptor 2A (5HT2A) Htr2 Serotonin Receptor 2A
Type:
G Protein-Coupled Receptor (GPCR)
Mol. Mass.:
52852.05
Organism:
Rattus norvegicus (rat)
Description:
Rat cortex membranes 5-HT2A receptors.
Residue:
471
  
Inhibitor
Name:
BDBM21398
Synonyms:
4-[4-(4-Chloro-phenyl)-4-hydroxy-piperidin-1-yl]-1-(4-fluoro-phenyl)-butan-1-one;propionate(HCl) CHEMBL54 Haloperidol | Haloperidol, 1
Type:
Small organic molecule
Emp. Form.:
C21H23ClFNO2
Mol. Mass.:
375.864
SMILES:
OC1(CCN(CCCC(=O)c2ccc(F)cc2)CC1)c1ccc(Cl)cc1
: