Target
Glutamyl aminopeptidase
Ligand
BDBM50036958
Substrate
Meas. Tech.
ChEMBL_32829 (CHEMBL646207)
Ki
870.0±n/a nM
Citation
 Chauvel, ENLlorens-Cortès, CCoric, PWilk, SRoques, BPFournié-Zaluski, MC Differential inhibition of aminopeptidase A and aminopeptidase N by new beta-amino thiols. J Med Chem 37:2950-7 (1994)  
Target
Name:
Glutamyl aminopeptidase
Synonyms:
AMPE_HUMAN Aminopeptidase A Differentiation antigen gp160 ENPEP | Glutamyl aminopeptidase
Type:
PROTEIN
Mol. Mass.:
109226.47
Organism:
Homo sapiens (Human)
Description:
ChEMBL_32829
Residue:
957
  
Inhibitor
Name:
BDBM50036958
Synonyms:
(S)-4-Amino-5-mercapto-2-methyl-pentanoic acid | CHEMBL103952
Type:
Small organic molecule
Emp. Form.:
C6H13NO2S
Mol. Mass.:
163.238
SMILES:
CC(C[C@H](N)CS)C(O)=O
: