Target
Beta-secretase 1
Ligand
BDBM16271
Substrate
Meas. Tech.
ChEMBL_968734 (CHEMBL2399170)
Ki
25±n/a nM
Citation
 Yuan, JVenkatraman, SZheng, YMcKeever, BMDillard, LWSingh, SB Structure-based design of ?-site APP cleaving enzyme 1 (BACE1) inhibitors for the treatment of Alzheimer's disease. J Med Chem 56:4156-80 (2013)  
Target
Name:
Beta-secretase 1
Synonyms:
ASP2 Aspartyl protease 2 BACE1 Beta-secretase (BACE) Beta-secretase 1 (BACE 1) Beta-secretase 1 (BACE1) Beta-site amyloid precursor protein cleaving enzyme 1 Memapsin-2 beta-Secretase (BACE-1) | beta-Secretase (BACE1)
Type:
Protein
Mol. Mass.:
55755.10
Organism:
Homo sapiens (Human)
Description:
P56817
Residue:
501
  
Inhibitor
Name:
BDBM16271
Synonyms:
(2R,4S,5S)-N-[(1S)-1-(benzylcarbamoyl)-2-methylpropyl]-4-hydroxy-2,7-dimethyl-5-{[(4S,7S)-2,5,9-trioxo-4-(propan-2-yl)-1-oxa-3,6,10-triazacyclohexadecan-7-yl]formamido}octanamide | amide-urethane derived inhibitor 2c
Type:
Small organic molecule
Emp. Form.:
C38H62N6O8
Mol. Mass.:
730.9343
SMILES:
CC(C)C[C@H](NC(=O)[C@@H]1CC(=O)NCCCCCCOC(=O)N[C@@H](C(C)C)C(=O)N1)[C@@H](O)C[C@@H](C)C(=O)N[C@@H](C(C)C)C(=O)NCc1ccccc1
: