Target
Mu-type opioid receptor
Ligand
BDBM50474150
Substrate
Meas. Tech.
ChEMBL_968739 (CHEMBL2399175)
Ki
0.010000±n/a nM
Citation
 Raffa, RBBeckett, JRBrahmbhatt, VNEbinger, TMFabian, CANixon, JROrlando, STRana, CATejani, AHTomazic, RJ Orally active opioid compounds from a non-poppy source. J Med Chem 56:4840-8 (2013)  
Target
Name:
Mu-type opioid receptor
Synonyms:
M-OR-1 MOR-1 MUOR1 Mu opiate receptor OPRM1 hMOP | mu-type opioid receptor isoform MOR-1
Type:
G Protein-Coupled Receptor (GPCR)
Mol. Mass.:
44789.51
Organism:
Homo sapiens (Human)
Description:
P35372
Residue:
400
  
Inhibitor
Name:
BDBM50474150
Synonyms:
CHEMBL58362
Type:
Small organic molecule
Emp. Form.:
C23H30N2O5
Mol. Mass.:
414.4947
SMILES:
[H][C@@]12C[C@]([H])(C(=C/OC)\C(=O)OC)[C@]([H])(CC)CN1CC[C@]21Nc2cccc(OC)c2C1=O
: