Target
Reverse transcriptase
Ligand
BDBM50492111
Substrate
Meas. Tech.
ChEMBL_969007 (CHEMBL2400596)
IC50
8300±n/a nM
Citation
 Masaoka, TChung, SCaboni, PRausch, JWWilson, JATaskent-Sezgin, HBeutler, JATocco, GLe Grice, SF Exploiting drug-resistant enzymes as tools to identify thienopyrimidinone inhibitors of human immunodeficiency virus reverse transcriptase-associated ribonuclease H. J Med Chem 56:5436-45 (2013)  
Target
Name:
Reverse transcriptase
Synonyms:
Type:
Protein
Mol. Mass.:
29598.37
Organism:
Human immunodeficiency virus 1
Description:
Q9WKE8
Residue:
254
  
Inhibitor
Name:
BDBM50492111
Synonyms:
CHEMBL2397290
Type:
Small organic molecule
Emp. Form.:
C13H11N3OS
Mol. Mass.:
257.311
SMILES:
Cc1sc2nc([nH]c(=O)c2c1C)-c1cccnc1
: