Target
Tyrosine-protein kinase Lck
Ligand
BDBM50037398
Substrate
Meas. Tech.
ChEMBL_151530 (CHEMBL762243)
IC50
>2000000±n/a nM
Citation
 Cushman, MZhu, HGeahlen, RLKraker, AJ Synthesis and biochemical evaluation of a series of aminoflavones as potential inhibitors of protein-tyrosine kinases p56lck, EGFr, and p60v-src. J Med Chem 37:3353-62 (1994)  
Target
Name:
Tyrosine-protein kinase Lck
Synonyms:
2.7.10.2 LCK_HUMAN Leukocyte C-terminal Src kinase Lymphocyte-specific protein tyrosine kinase Protein YT16 Proto-oncogene tyrosine-protein kinase LCK T cell-specific protein-tyrosine kinase
Type:
Mol. Mass.:
57987.83
Organism:
Homo sapiens (Human)
Description:
P06239
Residue:
509
  
Inhibitor
Name:
BDBM50037398
Synonyms:
6-Nitro-2-(4-nitro-phenyl)-chromen-4-one | CHEMBL64704
Type:
Small organic molecule
Emp. Form.:
C15H8N2O6
Mol. Mass.:
312.2338
SMILES:
[O-][N+](=O)c1ccc(cc1)-c1cc(=O)c2cc(ccc2o1)[N+]([O-])=O
: