Target
Epidermal growth factor receptor
Ligand
BDBM50037406
Substrate
Meas. Tech.
ChEMBL_66715 (CHEMBL674638)
IC50
>100000±n/a nM
Citation
 Cushman, MZhu, HGeahlen, RLKraker, AJ Synthesis and biochemical evaluation of a series of aminoflavones as potential inhibitors of protein-tyrosine kinases p56lck, EGFr, and p60v-src. J Med Chem 37:3353-62 (1994)  
Target
Name:
Epidermal growth factor receptor
Synonyms:
EGF Receptor Substrate EGFR_HUMAN ERBB1 Epidermal Growth Factor Receptor erbB-1 Epidermal growth factor receptor (EGFR) HER1 Proto-oncogene c-ErbB-1 Tyrosine-Protein Kinase ErbB-1
Type:
Receptor Kinase Domain
Mol. Mass.:
134279.59
Organism:
Homo sapiens (Human)
Description:
P00533
Residue:
1210
  
Inhibitor
Name:
BDBM50037406
Synonyms:
8-Amino-2-(4-amino-phenyl)-6-hydroxy-chromen-4-one | CHEMBL112421
Type:
Small organic molecule
Emp. Form.:
C15H12N2O3
Mol. Mass.:
268.2674
SMILES:
Nc1ccc(cc1)-c1cc(=O)c2cc(O)cc(N)c2o1
: