Target
Adenosine receptor A1
Ligand
BDBM82558
Substrate
Meas. Tech.
ChEMBL_29643 (CHEMBL639750)
Ki
37±n/a nM
Citation
 Kim, HOJi, XDMelman, NOlah, MEStiles, GLJacobson, KA Structure-activity relationships of 1,3-dialkylxanthine derivatives at rat A3 adenosine receptors. J Med Chem 37:3373-82 (1994)  
Target
Name:
Adenosine receptor A1
Synonyms:
AA1R_RAT ADENOSINE A1 high Adenosine A1 receptor (A1) Adenosine receptors A1 | Adora1
Type:
Protein
Mol. Mass.:
36704.13
Organism:
Rattus norvegicus (rat)
Description:
Residue:
326
  
Inhibitor
Name:
BDBM82558
Synonyms:
CAS_163889 I-ABOPX | NSC_163889
Type:
Small organic molecule
Emp. Form.:
C23H22IN5O5
Mol. Mass.:
575.3558
SMILES:
CCCn1c(=O)n(Cc2ccc(N)c(I)c2)c2nc([nH]c2c1=O)-c1ccc(OCC(O)=O)cc1
: