Target
Adenosine receptor A3
Ligand
BDBM50018417
Substrate
Meas. Tech.
ChEMBL_30615 (CHEMBL642022)
Ki
6770.0±n/a nM
Citation
 Kim, HOJi, XDMelman, NOlah, MEStiles, GLJacobson, KA Structure-activity relationships of 1,3-dialkylxanthine derivatives at rat A3 adenosine receptors. J Med Chem 37:3373-82 (1994)  
Target
Name:
Adenosine receptor A3
Synonyms:
AA3R_RAT Adenosine receptor A2a and A3 | Adora3
Type:
PROTEIN
Mol. Mass.:
36643.73
Organism:
Rattus norvegicus
Description:
ChEMBL_479910
Residue:
320
  
Inhibitor
Name:
BDBM50018417
Synonyms:
CHEMBL294463 | [4-(6-Oxo-1,3-dipropyl-2-thioxo-2,3,6,7-tetrahydro-1H-purin-8-yl)-phenoxy]-acetic acid
Type:
Small organic molecule
Emp. Form.:
C19H22N4O4S
Mol. Mass.:
402.467
SMILES:
CCCn1c2nc([nH]c2c(=O)n(CCC)c1=S)-c1ccc(OCC(O)=O)cc1
: