Target
Gag-Pol polyprotein [489-587]
Ligand
BDBM50037541
Substrate
Meas. Tech.
ChEMBL_159296 (CHEMBL763336)
IC50
6.1±n/a nM
Citation
 Dorsey, BDLevin, RBMcDaniel, SLVacca, JPGuare, JPDarke, PLZugay, JAEmini, EASchleif, WAQuintero, JC L-735,524: the design of a potent and orally bioavailable HIV protease inhibitor. J Med Chem 37:3443-51 (1994)  
Target
Name:
Gag-Pol polyprotein [489-587]
Synonyms:
Human immunodeficiency virus type 1 protease Pol polyprotein | gag-pol
Type:
Enzyme Subunit
Mol. Mass.:
10781.16
Organism:
Human immunodeficiency virus type 1
Description:
P04585[489-587]
Residue:
99
  
Inhibitor
Name:
BDBM50037541
Synonyms:
(S)-4-Ethyl-1-[(2S,4R)-2-hydroxy-4-((R)-(R)-2-hydroxy-indan-1-ylcarbamoyl)-5-phenyl-pentyl]-piperazine-2-carboxylic acid tert-butylamide | CHEMBL333610
Type:
Small organic molecule
Emp. Form.:
C32H46N4O4
Mol. Mass.:
550.732
SMILES:
CCN1CCN(C[C@@H](O)C[C@@H](Cc2ccccc2)C(=O)NC2[C@H](O)Cc3ccccc23)[C@@H](C1)C(=O)NC(C)(C)C
: