Target
Sterol O-acyltransferase 1
Ligand
BDBM50037663
Substrate
Meas. Tech.
ChEMBL_28496 (CHEMBL645926)
IC50
8±n/a nM
Citation
 Higley, CAWilde, RGMaduskuie, TPJohnson, ALPennev, PBillheimer, JTRobinson, CSGillies, PJWexler, RR Acyl CoA:cholesterol acyltransferase (ACAT) inhibitors: synthesis and structure-activity relationship studies of a new series of trisubstituted imidazoles. J Med Chem 37:3511-22 (1994)  
Target
Name:
Sterol O-acyltransferase 1
Synonyms:
ACAT-1 Acat SOAT1_RAT Sterol O-acyltransferase, Soat
Type:
PROTEIN
Mol. Mass.:
64165.56
Organism:
Rattus norvegicus
Description:
ChEMBL_28796
Residue:
545
  
Inhibitor
Name:
BDBM50037663
Synonyms:
3-(2,4-Difluoro-phenyl)-1-[5-(4,5-diphenyl-1H-imidazole-2-sulfinyl)-pentyl]-1-heptyl-urea | CHEMBL119295
Type:
Small organic molecule
Emp. Form.:
C34H40F2N4O2S
Mol. Mass.:
606.769
SMILES:
CCCCCCCN(CCCCCS(=O)c1nc(c([nH]1)-c1ccccc1)-c1ccccc1)C(=O)Nc1ccc(F)cc1F
: