Target
D(2) dopamine receptor
Ligand
BDBM50037673
Substrate
Meas. Tech.
ChEMBL_61753 (CHEMBL676060)
IC50
420±n/a nM
Citation
 Wright, JLCaprathe, BWDowning, DMGlase, SAHeffner, TGJaen, JCJohnson, SJKesten, SRMacKenzie, RGMeltzer, LT The discovery and structure-activity relationships of 1,2,3,6-tetrahydro-4-phenyl-1-[(arylcyclohexenyl)alkyl]pyridines. Dopamine autoreceptor agonists and potential antipsychotic agents. J Med Chem 37:3523-33 (1994)  
Target
Name:
D(2) dopamine receptor
Synonyms:
DOPAMINE D2 DOPAMINE D2 Short Dopamine D2 receptor Drd2
Type:
G Protein-Coupled Receptor (GPCR)
Mol. Mass.:
50931.60
Organism:
Rattus norvegicus (rat)
Description:
P61169
Residue:
444
  
Inhibitor
Name:
BDBM50037673
Synonyms:
4-Phenyl-1-(3-phenyl-cyclohex-2-enylmethyl)-1,2,3,6-tetrahydro-pyridine | CHEMBL119339
Type:
Small organic molecule
Emp. Form.:
C24H27N
Mol. Mass.:
329.4779
SMILES:
C(C1CCCC(=C1)c1ccccc1)N1CCC(=CC1)c1ccccc1
: