Target
Adenosine deaminase
Ligand
BDBM50037903
Substrate
Meas. Tech.
ChEMBL_30936 (CHEMBL646740)
Ki
3.8±n/a nM
Citation
 Vargeese, CSarma, MSPragnacharyulu, PVAbushanab, ELi, SYStoeckler, JD Adenosine deaminase inhibitors. Synthesis and biological evaluation of putative metabolites of (+)-erythro-9-(2S-hydroxy-3R-nonyl)adenine. J Med Chem 37:3844-9 (1994)  
Target
Name:
Adenosine deaminase
Synonyms:
ADA Adenosine aminohydrolase
Type:
Enzyme
Mol. Mass.:
40910.44
Organism:
Bos taurus (bovine)
Description:
Residue:
363
  
Inhibitor
Name:
BDBM50037903
Synonyms:
6-Amino-9-hydroxy-9-[(R)-1-((S)-1-hydroxy-ethyl)-heptyl]-9H-purin-9-ium | CHEMBL127469
Type:
Small organic molecule
Emp. Form.:
C14H23N5O2
Mol. Mass.:
293.3647
SMILES:
CCCCCC[C@H]([C@H](C)O)[N+]1([O-])C=Nc2c1ncnc2N
: