Target
Delta-type opioid receptor
Ligand
BDBM50492645
Substrate
Meas. Tech.
ChEMBL_974642 (CHEMBL2410568)
Ki
1.7±n/a nM
Citation
 Pickett, JENagakura, KPasternak, ARGrinnell, SGMajumdar, SLewis, JSPasternak, GW Sandmeyer reaction repurposed for the site-selective, non-oxidizing radioiodination of fully-deprotected peptides: studies on the endogenous opioid peptide ?-neoendorphin. Bioorg Med Chem Lett 23:4347-50 (2013)  
Target
Name:
Delta-type opioid receptor
Synonyms:
D-OR-1 Delta opioid receptor OPIATE Delta OPRD1 OPRK1 | opioid receptor, delta 1
Type:
G Protein-Coupled Receptor (GPCR)
Mol. Mass.:
40382.98
Organism:
Homo sapiens (Human)
Description:
Competition binding assays were carried out using membrane preparations from transfected HN9.10 cells that constitutively expressed the delta opioid receptor.
Residue:
372
  
Inhibitor
Name:
BDBM50492645
Synonyms:
CHEMBL2409222
Type:
Small organic molecule
Emp. Form.:
C60H89N15O13
Mol. Mass.:
1228.4414
SMILES:
CC(C)C[C@H](NC(=O)[C@H](Cc1ccccc1)NC(=O)CNC(=O)CNC(=O)[C@@H](N)Cc1ccc(O)cc1)C(=O)N[C@@H](CCCNC(N)=N)C(=O)N[C@@H](CCCCN)C(=O)N[C@@H](Cc1ccc(O)cc1)C(=O)N1CCC[C@H]1C(=O)N[C@@H](CCCCN)C(O)=O
: