Target
Angiotensin-converting enzyme
Ligand
BDBM50038068
Substrate
Meas. Tech.
ChEMBL_36000 (CHEMBL644708)
IC50
2300±n/a nM
Citation
 Waszkowycz, BClark, DEFrenkel, DLi, JMurray, CWRobson, BWesthead, DR PRO_LIGAND: an approach to de novo molecular design. 2. Design of novel molecules from molecular field analysis (MFA) models and pharmacophores. J Med Chem 37:3994-4002 (1994)  
Target
Name:
Angiotensin-converting enzyme
Synonyms:
ACE Angiotensin converting enzyme (ACE) Angiotensin-converting enzyme, soluble form CD_antigen=CD143 DCP1 Kininase II
Type:
Enzyme
Mol. Mass.:
149709.01
Organism:
Homo sapiens (Human)
Description:
Residue:
1306
  
Inhibitor
Name:
BDBM50038068
Synonyms:
(R)-1-[(S)-2-((S)-2-Amino-4-methyl-pentanoylamino)-propionyl]-pyrrolidine-2-carboxylic acid | CHEMBL340119
Type:
Small organic molecule
Emp. Form.:
C14H25N3O4
Mol. Mass.:
299.366
SMILES:
CC(C)C[C@H](N)C(=O)N[C@@H](C)C(=O)N1CCC[C@@H]1C(O)=O
: