Target
Muscarinic acetylcholine receptor
Ligand
BDBM50006584
Substrate
Meas. Tech.
ChEMBL_138227 (CHEMBL744918)
EC50
6500±n/a nM
Citation
 Moltzen, EKPedersen, HBøgesø, KPMeier, EFrederiksen, KSánchez, CLøve Lembøl, H Bioisosteres of arecoline: 1,2,3,6-tetrahydro-5-pyridyl-substituted and 3-piperidyl-substituted derivatives of tetrazoles and 1,2,3-triazoles. Synthesis and muscarinic activity. J Med Chem 37:4085-99 (1995)  
Target
Name:
Muscarinic acetylcholine receptor
Synonyms:
GPM3 | Muscarinic acetylcholine receptor M3
Type:
Mol. Mass.:
66272.13
Organism:
Cavia porcellus
Description:
Residue:
587
  
Inhibitor
Name:
BDBM50006584
Synonyms:
(McN-A-343) [4-(3-Chloro-phenylcarbamoyloxy)-but-2-ynyl]-trimethyl-ammonium; chloride 4-(3-chlorophenylcarbamoyloxy)-N,N,N-trimethylbut-2-yn-1-aminium CHEMBL40554 McN-A-343 [4-(3-Chloro-phenylcarbamoyloxy)-but-2-ynyl]-trimethyl-ammonium; chloride (McN-A-343)
Type:
Small organic molecule
Emp. Form.:
C14H18ClN2O2
Mol. Mass.:
281.757
SMILES:
C[N+](C)(C)CC#CCOC(=O)Nc1cccc(Cl)c1
: