Target
Muscarinic acetylcholine receptor M2
Ligand
BDBM50038210
Substrate
Meas. Tech.
ChEMBL_139979 (CHEMBL751165)
EC50
>51000±n/a nM
Citation
 Moltzen, EKPedersen, HBøgesø, KPMeier, EFrederiksen, KSánchez, CLøve Lembøl, H Bioisosteres of arecoline: 1,2,3,6-tetrahydro-5-pyridyl-substituted and 3-piperidyl-substituted derivatives of tetrazoles and 1,2,3-triazoles. Synthesis and muscarinic activity. J Med Chem 37:4085-99 (1995)  
Target
Name:
Muscarinic acetylcholine receptor M2
Synonyms:
ACM2_HUMAN Cholinergic, muscarinic M2 Muscarinic acetylcholine receptor M2 and M5 | RecName: Full=Muscarinic acetylcholine receptor M2
Type:
GPCR
Mol. Mass.:
51730.61
Organism:
Homo sapiens (Human)
Description:
P08172
Residue:
466
  
Inhibitor
Name:
BDBM50038210
Synonyms:
5-(2-Ethyl-2H-tetrazol-5-yl)-1-methyl-1,2,3,6-tetrahydro-pyridine CHEMBL131428
Type:
Small organic molecule
Emp. Form.:
C9H15N5
Mol. Mass.:
193.2489
SMILES:
CCn1nnc(n1)C1=CCCN(C)C1
: