Target
Carbonic anhydrase 12
Ligand
BDBM50492460
Substrate
Meas. Tech.
ChEMBL_975779 (CHEMBL2415307)
Ki
0.240000±n/a nM
Citation
 Akdemir, AGüzel-Akdemir, OScozzafava, ACapasso, CSupuran, CT Inhibition of tumor-associated human carbonic anhydrase isozymes IX and XII by a new class of substituted-phenylacetamido aromatic sulfonamides. Bioorg Med Chem 21:5228-32 (2013)  
Target
Name:
Carbonic anhydrase 12
Synonyms:
CA-XII CAH12_HUMAN Carbonic anhydrase Carbonic anhydrase XII Carbonic anhydrase XII (CAXII) | Tumor antigen HOM-RCC-3.1.3
Type:
Enzyme
Mol. Mass.:
39456.00
Organism:
Homo sapiens (Human)
Description:
Catalytic domain of human cloned isozyme was used in the assay
Residue:
354
  
Inhibitor
Name:
BDBM50492460
Synonyms:
CHEMBL2402776
Type:
Small organic molecule
Emp. Form.:
C15H15ClN2O4S
Mol. Mass.:
354.809
SMILES:
COc1ccc(CC(=O)Nc2ccc(cc2Cl)S(N)(=O)=O)cc1
: