Target
5-lipoxygenase
Ligand
BDBM50038655
Substrate
Meas. Tech.
ChEMBL_3987 (CHEMBL619259)
IC50
1700±n/a nM
Citation
 Laufer, SAAugustin, JDannhardt, GKiefer, W (6,7-Diaryldihydropyrrolizin-5-yl)acetic acids, a novel class of potent dual inhibitors of both cyclooxygenase and 5-lipoxygenase. J Med Chem 37:1894-7 (1994)  
Target
Name:
5-lipoxygenase
Synonyms:
Arachidonate 5-lipoxygenase
Type:
PROTEIN
Mol. Mass.:
49994.23
Organism:
Bos taurus
Description:
ChEMBL_157766
Residue:
430
  
Inhibitor
Name:
BDBM50038655
Synonyms:
CHEMBL54485 | [2-(3,4-Dichloro-phenyl)-6,6-dimethyl-1-phenyl-6,7-dihydro-5H-pyrrolizin-3-yl]-acetic acid
Type:
Small organic molecule
Emp. Form.:
C23H21Cl2NO2
Mol. Mass.:
414.324
SMILES:
CC1(C)Cc2c(c(c(CC(O)=O)n2C1)-c1ccc(Cl)c(Cl)c1)-c1ccccc1
: