Target
Amine oxidase [flavin-containing] B
Ligand
BDBM50038943
Substrate
Meas. Tech.
ChEMBL_100095 (CHEMBL709713)
IC50
7000±n/a nM
Citation
 Harfenist, MJoyner, CTMize, PDWhite, HL Selective inhibitors of monoamine oxidase. 2. Arylamide SAR. J Med Chem 37:2085-9 (1994)  
Target
Name:
Amine oxidase [flavin-containing] B
Synonyms:
AOFB_RAT Amine oxidase [flavin-containing] B Monoamine Oxidase Type B (MAO-B) Monoamine oxidase B (MAO-B) Monoamine oxidase type B (MAOB) | Monoamine oxidase-B (MAO-B)
Type:
Enzyme
Mol. Mass.:
58469.65
Organism:
Rattus norvegicus (rat)
Description:
P19643
Residue:
520
  
Inhibitor
Name:
BDBM50038943
Synonyms:
CHEMBL66260 | N-(7-Acetylamino-10-methyl-5,5-dioxo-5,10-dihydro-5lambda*6*-phenothiazin-3-yl)-acetamide
Type:
Small organic molecule
Emp. Form.:
C17H17N3O4S
Mol. Mass.:
359.4
SMILES:
CN1c2ccc(NC(C)=O)cc2S(=O)(=O)c2cc(NC(C)=O)ccc12
: