Target
Platelet-derived growth factor receptor alpha/beta
Ligand
BDBM50039094
Substrate
Meas. Tech.
ChEMBL_154737 (CHEMBL763802)
IC50
50±n/a nM
Citation
 Maguire, MPSheets, KRMcVety, KSpada, APZilberstein, A A new series of PDGF receptor tyrosine kinase inhibitors: 3-substituted quinoline derivatives. J Med Chem 37:2129-37 (1994)  
Target
Name:
Platelet-derived growth factor receptor alpha/beta
Synonyms:
PDGFR-beta/Platelet-derived growth factor receptor alpha Platelet-derived growth factor receptor alpha /beta
Type:
Mol. Mass.:
Description:
ASSAY_ID of EBI is 29498
Components:
This complex has 2 components.
Component 1
Name:
Platelet-derived growth factor receptor beta
Synonyms:
Beta-type platelet-derived growth factor receptor CD140b antigen PDGF Receptor Substrate PDGFR PDGFR-1 PDGFRB PGFRB_HUMAN Platelet-derived growth factor receptor 1 Platelet-derived growth factor receptor beta (PDGFR-beta) Platelet-derived growth factor receptor beta (PDGFRbeta) | VHL/PDGFRB
Type:
Enzyme
Mol. Mass.:
123922.25
Organism:
Homo sapiens (Human)
Description:
P09619
Residue:
1106
  
Component 2
Name:
Platelet-derived growth factor receptor alpha
Synonyms:
Alpha-type platelet-derived growth factor receptor PDGFRA PGFRA_HUMAN Platelet-derived growth factor receptor alpha (PDGFRA) RHEPDGFRA
Type:
Protein
Mol. Mass.:
122633.38
Organism:
Homo sapiens (Human)
Description:
P16234
Residue:
1089
  
Inhibitor
Name:
BDBM50039094
Synonyms:
6,7-Dimethoxy-3-phenylethynyl-quinoline | CHEMBL67059
Type:
Small organic molecule
Emp. Form.:
C19H15NO2
Mol. Mass.:
289.3279
SMILES:
COc1cc2cc(cnc2cc1OC)C#Cc1ccccc1
: