Target
Epidermal growth factor receptor
Ligand
BDBM112499
Substrate
Meas. Tech.
ChEMBL_980992 (CHEMBL2427713)
IC50
11±n/a nM
Citation
 Ward, RAAnderton, MJAshton, SBethel, PABox, MButterworth, SColclough, NChorley, CGChuaqui, CCross, DADakin, LADebreczeni, JÉEberlein, CFinlay, MRHill, GBGrist, MKlinowska, TCLane, CMartin, SOrme, JPSmith, PWang, FWaring, MJ Structure- and reactivity-based development of covalent inhibitors of the activating and gatekeeper mutant forms of the epidermal growth factor receptor (EGFR). J Med Chem 56:7025-48 (2013)  
Target
Name:
Epidermal growth factor receptor
Synonyms:
EGF Receptor Substrate EGFR_HUMAN ERBB1 Epidermal Growth Factor Receptor erbB-1 Epidermal growth factor receptor (EGFR) HER1 Proto-oncogene c-ErbB-1 Tyrosine-Protein Kinase ErbB-1
Type:
Receptor Kinase Domain
Mol. Mass.:
134279.59
Organism:
Homo sapiens (Human)
Description:
P00533
Residue:
1210
  
Inhibitor
Name:
BDBM112499
Synonyms:
DACOMITINIB WO2022090481, Example dacomitinib
Type:
Small organic molecule
Emp. Form.:
C24H25ClFN5O2
Mol. Mass.:
469.939
SMILES:
COc1cc2ncnc(Nc3ccc(F)c(Cl)c3)c2cc1NC(=O)\C=C\CN1CCCCC1
: