Target
Mu-type opioid receptor
Ligand
BDBM50039183
Substrate
Meas. Tech.
ChEMBL_138999 (CHEMBL744599)
Ki
0.77±n/a nM
Citation
 Zimmerman, DMGidda, JSCantrell, BESchoepp, DDJohnson, BGLeander, JD Discovery of a potent, peripherally selective trans-3,4-dimethyl-4-(3-hydroxyphenyl)piperidine opioid antagonist for the treatment of gastrointestinal motility disorders. J Med Chem 37:2262-5 (1994)  
Target
Name:
Mu-type opioid receptor
Synonyms:
MOR-1 Mu-type opioid receptor (MOR) OPRM_RAT Opioid receptor B Ror-b
Type:
G Protein-Coupled Receptor (GPCR)
Mol. Mass.:
44503.11
Organism:
Rattus norvegicus (rat)
Description:
Competition binding assays were carried out using membrane preparations from transfected HN9.10 cells that constitutively expressed the mu opioid receptor.
Residue:
398
  
Inhibitor
Name:
BDBM50039183
Synonyms:
CHEMBL72850 | {(S)-2-Benzyl-3-[4-(3-hydroxy-phenyl)-3,4-dimethyl-piperidin-1-yl]-propionylamino}-acetic acid
Type:
Small organic molecule
Emp. Form.:
C25H32N2O4
Mol. Mass.:
424.5326
SMILES:
CC1CN(C[C@H](Cc2ccccc2)C(=O)NCC(O)=O)CCC1(C)c1cccc(O)c1
: