Target
Angiotensin-converting enzyme
Ligand
BDBM50039498
Substrate
Meas. Tech.
ChEMBL_34913 (CHEMBL648449)
IC50
>1000±n/a nM
Citation
 Neustadt, BRSmith, EMNechuta, TLBronnenkant, AAHaslanger, MFWatkins, RWFoster, CJSybertz, EJ Mercaptoacyl amino acid inhibitors of atriopeptidase. 1. Structure-activity relationship studies of methionine and S-alkylcysteine derivatives. J Med Chem 37:2461-76 (1994)  
Target
Name:
Angiotensin-converting enzyme
Synonyms:
3.2.1.- ACE Angiotensin-converting enzyme, soluble form DCP1 Kininase II
Type:
Mol. Mass.:
150405.15
Organism:
Oryctolagus cuniculus
Description:
Residue:
1310
  
Inhibitor
Name:
BDBM50039498
Synonyms:
(S)-2-((R)-2-Mercaptomethyl-3-phenyl-propionylamino)-3-phenethylsulfanyl-propionic acid | CHEMBL83704
Type:
Small organic molecule
Emp. Form.:
C21H25NO3S2
Mol. Mass.:
403.558
SMILES:
OC(=O)[C@@H](CSCCc1ccccc1)NC(=O)[C@H](CS)Cc1ccccc1
: