Target
Vesicular acetylcholine transporter
Ligand
BDBM50018094
Substrate
Meas. Tech.
ChEMBL_213554 (CHEMBL816914)
Ki
1±n/a nM
Citation
 Efange, SMKhare, ABFoulon, CAkella, SKParsons, SM Spirovesamicols: conformationally restricted analogs of 2-(4-phenylpiperidino)cyclohexanol (vesamicol, AH5183) as potential modulators of presynaptic cholinergic function. J Med Chem 37:2574-82 (1994)  
Target
Name:
Vesicular acetylcholine transporter
Synonyms:
TorVAChT VAChT
Type:
PROTEIN
Mol. Mass.:
56111.93
Organism:
Torpedo californica
Description:
ChEMBL_1503355
Residue:
515
  
Inhibitor
Name:
BDBM50018094
Synonyms:
(1R,2R)-2-(4-Phenyl-piperidin-1-yl)-cyclohexanol 2-(4-Phenyl-piperidin-1-yl)-cyclohexanol(Vesamicol) Vesamicol | trans-2-(4-phenylpiperidin-1-yl)cyclohexanol
Type:
Small organic molecule
Emp. Form.:
C17H25NO
Mol. Mass.:
259.3865
SMILES:
O[C@@H]1CCCC[C@H]1N1CCC(CC1)c1ccccc1
: