Target
Vesicular acetylcholine transporter
Ligand
BDBM50039617
Substrate
Meas. Tech.
ChEMBL_213554 (CHEMBL816914)
Ki
0.36±n/a nM
Citation
 Efange, SMKhare, ABFoulon, CAkella, SKParsons, SM Spirovesamicols: conformationally restricted analogs of 2-(4-phenylpiperidino)cyclohexanol (vesamicol, AH5183) as potential modulators of presynaptic cholinergic function. J Med Chem 37:2574-82 (1994)  
Target
Name:
Vesicular acetylcholine transporter
Synonyms:
TorVAChT VAChT
Type:
PROTEIN
Mol. Mass.:
56111.93
Organism:
Torpedo californica
Description:
ChEMBL_1503355
Residue:
515
  
Inhibitor
Name:
BDBM50039617
Synonyms:
1-(4-fluorobenzyl)-3-spiro[2,3-dihydro-1H-indene-1,4'-(hexahydropyridine)]-1-yl-(3R,4R)-hexahydro-4-pyridinol | CHEMBL87414
Type:
Small organic molecule
Emp. Form.:
C25H31FN2O
Mol. Mass.:
394.5248
SMILES:
O[C@@H]1CCN(Cc2ccc(F)cc2)C[C@H]1N1CCC2(CCc3ccccc23)CC1
: