Target
D(2) dopamine receptor
Ligand
BDBM50028979
Substrate
Meas. Tech.
ChEMBL_60060 (CHEMBL671374)
Ki
1100±n/a nM
Citation
 Phillips, STde Paulis, TBaron, BMSiegel, BWSeeman, PVan Tol, HHGuan, HCSmith, HE Binding of 5H-dibenzo[b,e][1,4]diazepine and chiral 5H-dibenzo[a,d]cycloheptene analogues of clozapine to dopamine and serotonin receptors. J Med Chem 37:2686-96 (1994)  
Target
Name:
D(2) dopamine receptor
Synonyms:
D(2) dopamine receptor DOPAMINE D2 Long DRD2 Dopamine D2 receptor Dopamine D2 receptor (D2R) Dopamine2-like | d2
Type:
Cell-surface receptors
Mol. Mass.:
50647.10
Organism:
Homo sapiens (Human)
Description:
P14416
Residue:
443
  
Inhibitor
Name:
BDBM50028979
Synonyms:
8-Chloro-5-methyl-11-(4-methyl-piperazin-1-yl)-5H-dibenzo[b,e][1,4]diazepine | CHEMBL266723
Type:
Small organic molecule
Emp. Form.:
C19H21ClN4
Mol. Mass.:
340.85
SMILES:
CN1CCN(CC1)C1=Nc2cc(Cl)ccc2N(C)c2ccccc12
: