Target
5-hydroxytryptamine receptor 2C
Ligand
BDBM50028980
Substrate
Meas. Tech.
ChEMBL_2817 (CHEMBL617846)
Ki
19±n/a nM
Citation
 Phillips, STde Paulis, TBaron, BMSiegel, BWSeeman, PVan Tol, HHGuan, HCSmith, HE Binding of 5H-dibenzo[b,e][1,4]diazepine and chiral 5H-dibenzo[a,d]cycloheptene analogues of clozapine to dopamine and serotonin receptors. J Med Chem 37:2686-96 (1994)  
Target
Name:
5-hydroxytryptamine receptor 2C
Synonyms:
5-HT2C 5-hydroxytryptamine receptor 2C (5HT2c) 5ht1c Htr2c Serotonin receptor 2a and 2c (5HT2A and 5HT2C)
Type:
Enzyme
Mol. Mass.:
51935.10
Organism:
Rattus norvegicus (Rat)
Description:
P08909
Residue:
460
  
Inhibitor
Name:
BDBM50028980
Synonyms:
8-Chloro-11-(4-methyl-piperazin-1-yl)-dibenzo[b,f][1,4]oxazepine CHEMBL7828 | Isoloxapine
Type:
Small organic molecule
Emp. Form.:
C18H18ClN3O
Mol. Mass.:
327.808
SMILES:
CN1CCN(CC1)C1=Nc2cc(Cl)ccc2Oc2ccccc12
: