Target
5-hydroxytryptamine receptor 2C
Ligand
BDBM50028978
Substrate
Meas. Tech.
ChEMBL_2816 (CHEMBL617845)
Ki
>1000±n/a nM
Citation
 Phillips, STde Paulis, TBaron, BMSiegel, BWSeeman, PVan Tol, HHGuan, HCSmith, HE Binding of 5H-dibenzo[b,e][1,4]diazepine and chiral 5H-dibenzo[a,d]cycloheptene analogues of clozapine to dopamine and serotonin receptors. J Med Chem 37:2686-96 (1994)  
Target
Name:
5-hydroxytryptamine receptor 2C
Synonyms:
5-HT2C 5-hydroxytryptamine receptor 2C (5HT2c) 5ht1c Htr2c Serotonin receptor 2a and 2c (5HT2A and 5HT2C)
Type:
Enzyme
Mol. Mass.:
51935.10
Organism:
Rattus norvegicus (Rat)
Description:
P08909
Residue:
460
  
Inhibitor
Name:
BDBM50028978
Synonyms:
1-(2-Chloro-5H-dibenzo[a,d]cyclohepten-10-yl)-4-methyl-piperidine | CHEMBL269396
Type:
Small organic molecule
Emp. Form.:
C21H22ClN
Mol. Mass.:
323.859
SMILES:
CC1CCN(CC1)C1=Cc2cc(Cl)ccc2Cc2ccccc12
: