Target
Adenosine receptor A1
Ligand
BDBM50039678
Substrate
Meas. Tech.
ChEMBL_29595 (CHEMBL640253)
IC50
3500±n/a nM
Citation
 Scammells, PJBaker, SPBelardinelli, LOlsson, RA Substituted 1,3-dipropylxanthines as irreversible antagonists of A1 adenosine receptors. J Med Chem 37:2704-12 (1994)  
Target
Name:
Adenosine receptor A1
Synonyms:
A1 adenosine receptor (hA1) AA1R_HUMAN ADORA1 Adenosine A1-receptor Adenosine receptor A1 (hA1) | Adenosine transporter (AdT)
Type:
G Protein-Coupled Receptor (GPCR)
Mol. Mass.:
36520.92
Organism:
Homo sapiens (Human)
Description:
P30542
Residue:
326
  
Inhibitor
Name:
BDBM50039678
Synonyms:
8-cyclopentyl-1,3-di[3-(4-fluorosulfonylphenylcarbonyloxy)propyl]-2,6-dioxo-2,3,6,7-tetrahydro-1H-purine | CHEMBL328033
Type:
Small organic molecule
Emp. Form.:
C30H30F2N4O10S2
Mol. Mass.:
708.707
SMILES:
FS(=O)(=O)c1ccc(cc1)C(=O)OCCCn1c2nc([nH]c2c(=O)n(CCCOC(=O)c2ccc(cc2)S(F)(=O)=O)c1=O)C1CCCC1
: