Target
Retinoic acid receptor gamma
Ligand
BDBM50040011
Substrate
Meas. Tech.
ChEMBL_196664 (CHEMBL803397)
Kd
>1000±n/a nM
Citation
 Boehm, MFZhang, LBadea, BAWhite, SKMais, DEBerger, ESuto, CMGoldman, MEHeyman, RA Synthesis and structure-activity relationships of novel retinoid X receptor-selective retinoids. J Med Chem 37:2930-41 (1994)  
Target
Name:
Retinoic acid receptor gamma
Synonyms:
NR1B3 RAR-gamma RARG_HUMAN Retinoic acid receptor gamma | Retinoid receptor
Type:
PROTEIN
Mol. Mass.:
50345.43
Organism:
Homo sapiens (Human)
Description:
ChEMBL_1458016
Residue:
454
  
Inhibitor
Name:
BDBM50040011
Synonyms:
4-(3-Bromo-5,5,8,8-tetramethyl-5,6,7,8-tetrahydro-naphthalene-2-carbonyl)-benzoic acid | CHEMBL101712
Type:
Small organic molecule
Emp. Form.:
C22H23BrO3
Mol. Mass.:
415.32
SMILES:
CC1(C)CCC(C)(C)c2cc(C(=O)c3ccc(cc3)C(O)=O)c(Br)cc12
: