Target
D(2) dopamine receptor
Ligand
BDBM50040078
Substrate
Meas. Tech.
ChEBML_62557
Ki
13±n/a nM
Citation
 Chumpradit, SKung, MPBillings, JMach, RKung, HF Fluorinated and iodinated dopamine agents: D2 imaging agents for PET and SPECT. J Med Chem 36:221-8 (1993)  
Target
Name:
D(2) dopamine receptor
Synonyms:
DOPAMINE D2 DOPAMINE D2 Short Dopamine D2 receptor Drd2
Type:
G Protein-Coupled Receptor (GPCR)
Mol. Mass.:
50931.60
Organism:
Rattus norvegicus (rat)
Description:
P61169
Residue:
444
  
Inhibitor
Name:
BDBM50040078
Synonyms:
CHEMBL305844 | N-(1-Ethyl-pyrrolidin-2-ylmethyl)-2-(2-fluoro-ethoxy)-3-methoxy-benzamide (FEOB)
Type:
Small organic molecule
Emp. Form.:
C17H25FN2O3
Mol. Mass.:
324.3904
SMILES:
CCN1CCC[C@@H]1CNC(=O)c1cccc(OC)c1OCCF
: