Target
Mu-type opioid receptor
Ligand
BDBM50040129
Substrate
Meas. Tech.
ChEMBL_223426 (CHEMBL844036)
IC50
61±n/a nM
Citation
 Kawasaki, AMKnapp, RJKramer, THWalton, AWire, WSHashimoto, SYamamura, HIPorreca, FBurks, TFHruby, VJ Design and synthesis of highly potent and selective cyclic dynorphin A analogs. 2. New analogs. J Med Chem 36:750-7 (1993)  
Target
Name:
Mu-type opioid receptor
Synonyms:
M-OR-1 Mu opioid receptor OPIATE Mu OPRM_CAVPO
Type:
Enzyme Catalytic Domain
Mol. Mass.:
11165.58
Organism:
GUINEA PIG
Description:
P97266
Residue:
98
  
Inhibitor
Name:
BDBM50040129
Synonyms:
CHEMBL408497 | Phe-Gly-Gly-Phe-c(Cys-Arg-Arg-Ile-Arg-Pro-Cys)
Type:
Small organic molecule
Emp. Form.:
C57H88N20O12S2
Mol. Mass.:
1309.565
SMILES:
CC[C@H](C)[C@H]1NC(=O)[C@H](CCCNC(N)=N)NC(=O)[C@@H](CCCNC(N)=N)NC(=O)[C@@H](CSSC[C@@H](NC(=O)[C@H]2CCCN2C(=O)[C@H](CCCNC(N)=N)NC1=O)C(O)=O)NC(=O)[C@H](Cc1ccccc1)NC(=O)CNC(=O)CNC(=O)[C@@H](N)Cc1ccccc1
: