Target
Kappa-type opioid receptor
Ligand
BDBM50040125
Substrate
Meas. Tech.
ChEMBL_223427 (CHEMBL845230)
IC50
0.035000±n/a nM
Citation
 Kawasaki, AMKnapp, RJKramer, THWalton, AWire, WSHashimoto, SYamamura, HIPorreca, FBurks, TFHruby, VJ Design and synthesis of highly potent and selective cyclic dynorphin A analogs. 2. New analogs. J Med Chem 36:750-7 (1993)  
Target
Name:
Kappa-type opioid receptor
Synonyms:
Kappa Opioid Receptor OPRK1 Opiate Kappa 1 | mu/kappa opioid receptor
Type:
G Protein-Coupled Receptor (GPCR)
Mol. Mass.:
42744.99
Organism:
Cavia porcellus (domestic guinea pig)
Description:
P41144
Residue:
380
  
Inhibitor
Name:
BDBM50040125
Synonyms:
CHEMBL438274 | Tyr-Gly-Gly-Phe-Leu-Arg-Arg-c(Cys-Arg-Pro-Lys-Leu-Cys)
Type:
Small organic molecule
Emp. Form.:
C69H111N23O15S2
Mol. Mass.:
1566.895
SMILES:
CC(C)C[C@H](NC(=O)[C@H](Cc1ccccc1)NC(=O)CNC(=O)CNC(=O)[C@@H](N)Cc1ccc(O)cc1)C(=O)N[C@@H](CCCNC(N)=N)C(=O)N[C@@H](CCCNC(N)=N)C(=O)N[C@H]1CSSC[C@@H](NC(=O)[C@@H](CC(C)C)NC(=O)[C@H](CCCCN)NC(=O)[C@H]2CCCN2C(=O)[C@H](CCCNC(N)=N)NC1=O)C(O)=O
: