Target
Delta-type opioid receptor
Ligand
BDBM50010702
Substrate
Meas. Tech.
ChEMBL_223435 (CHEMBL845237)
IC50
39.7±n/a nM
Citation
 Kawasaki, AMKnapp, RJKramer, THWalton, AWire, WSHashimoto, SYamamura, HIPorreca, FBurks, TFHruby, VJ Design and synthesis of highly potent and selective cyclic dynorphin A analogs. 2. New analogs. J Med Chem 36:750-7 (1993)  
Target
Name:
Delta-type opioid receptor
Synonyms:
DOR-1 MSL-2 OPRD_MOUSE Oprd1
Type:
Enzyme Catalytic Domain
Mol. Mass.:
40577.25
Organism:
MOUSE
Description:
P32300
Residue:
372
  
Inhibitor
Name:
BDBM50010702
Synonyms:
CHEMBL411557 Dynorphin A (1-17) Tyr-Gly-Gly-Phe-Leu-Arg-Arg-Ile-Arg-Pro-Lys-Leu-Lys-Trp-Asp-Asn-Gln | dynorphin A
Type:
Small organic molecule
Emp. Form.:
C99H155N31O23
Mol. Mass.:
2147.4839
SMILES:
CC[C@H](C)[C@H](NC(=O)[C@H](CCCN=C(N)N)NC(=O)[C@H](CCCNC(N)=N)NC(=O)[C@H](CC(C)C)NC(=O)[C@H](Cc1ccccc1)NC(=O)CNC(=O)CNC(=O)[C@@H](N)Cc1ccc(O)cc1)C(=O)N[C@@H](CCCN=C(N)N)C(=O)N1CCC[C@H]1C(=O)N[C@@H](CCCCN)C(=O)N[C@@H](CC(C)C)C(=O)N[C@@H](CCCCN)C(=O)N[C@@H](Cc1c[nH]c2ccccc12)C(=O)N[C@@H](CC(O)=O)C(=O)N[C@@H](CC(N)=O)C(=O)N[C@@H](CCC(N)=O)C(O)=O
: