Target
Mu-type opioid receptor
Ligand
BDBM50493826
Substrate
Meas. Tech.
ChEMBL_989754 (CHEMBL2445992)
EC50
158±n/a nM
Citation
 Chen, XTPitis, PLiu, GYuan, CGotchev, DCowan, CLRominger, DHKoblish, MDewire, SMCrombie, ALViolin, JDYamashita, DS Structure-activity relationships and discovery of a G protein biased ? opioid receptor ligand, [(3-methoxythiophen-2-yl)methyl]({2-[(9R)-9-(pyridin-2-yl)-6-oxaspiro-[4.5]decan-9-yl]ethyl})amine (TRV130), for the treatment of acute severe pain. J Med Chem 56:8019-31 (2013)  
Target
Name:
Mu-type opioid receptor
Synonyms:
M-OR-1 MOR-1 MUOR1 Mu opiate receptor OPRM1 hMOP | mu-type opioid receptor isoform MOR-1
Type:
G Protein-Coupled Receptor (GPCR)
Mol. Mass.:
44789.51
Organism:
Homo sapiens (Human)
Description:
P35372
Residue:
400
  
Inhibitor
Name:
BDBM50493826
Synonyms:
CHEMBL2443269
Type:
Small organic molecule
Emp. Form.:
C23H30N2O
Mol. Mass.:
350.4971
SMILES:
C(C[C@]1(CCOC2(CCCC2)C1)c1ccccn1)NCc1ccccc1
: