Target
Prostaglandin E2 receptor EP1 subtype
Ligand
BDBM50493968
Substrate
Meas. Tech.
ChEMBL_989430 (CHEMBL2443707)
Ki
8700±n/a nM
Citation
 Atobe, MNaganuma, KKawanishi, MMorimoto, AKasahara, KOhashi, SSuzuki, HHayashi, TMiyoshi, S Hit-to-lead optimization of 2-(1H-pyrazol-1-yl)-thiazole derivatives as a novel class of EP1 receptor antagonists. Bioorg Med Chem Lett 23:6064-7 (2013)  
Target
Name:
Prostaglandin E2 receptor EP1 subtype
Synonyms:
PE2R1_HUMAN PTGER1 Prostaglandin E2 receptor EP1 subtype Prostanoid EP1 receptor
Type:
Enzyme
Mol. Mass.:
41834.57
Organism:
Homo sapiens (Human)
Description:
P34995
Residue:
402
  
Inhibitor
Name:
BDBM50493968
Synonyms:
CHEMBL2442485
Type:
Small organic molecule
Emp. Form.:
C15H10F3N3O3S
Mol. Mass.:
369.318
SMILES:
COc1ccc(cc1)-c1cc(nn1-c1nc(cs1)C(O)=O)C(F)(F)F
: