Target
Prostaglandin E2 receptor EP1 subtype
Ligand
BDBM50493974
Substrate
Meas. Tech.
ChEMBL_989440 (CHEMBL2443717)
IC50
84±n/a nM
Citation
 Atobe, MNaganuma, KKawanishi, MMorimoto, AKasahara, KOhashi, SSuzuki, HHayashi, TMiyoshi, S Hit-to-lead optimization of 2-(1H-pyrazol-1-yl)-thiazole derivatives as a novel class of EP1 receptor antagonists. Bioorg Med Chem Lett 23:6064-7 (2013)  
Target
Name:
Prostaglandin E2 receptor EP1 subtype
Synonyms:
PE2R1_HUMAN PTGER1 Prostaglandin E2 receptor EP1 subtype Prostanoid EP1 receptor
Type:
Enzyme
Mol. Mass.:
41834.57
Organism:
Homo sapiens (Human)
Description:
P34995
Residue:
402
  
Inhibitor
Name:
BDBM50493974
Synonyms:
CHEMBL2442494
Type:
Small organic molecule
Emp. Form.:
C15H10F3N3O2S
Mol. Mass.:
353.319
SMILES:
Cc1c(nn(-c2nc(cs2)C(O)=O)c1C(F)(F)F)-c1ccccc1
: