Target
Polyunsaturated fatty acid 5-lipoxygenase
Ligand
BDBM50040422
Substrate
Meas. Tech.
ChEMBL_3810 (CHEMBL619885)
IC50
50±n/a nM
Citation
 Ducharme, YBrideau, CDubé, DChan, CCFalgueyret, JPGillard, JWGuay, JHutchinson, JHMcFarlane, CSRiendeau, D Naphthalenic lignan lactones as selective, nonredox 5-lipoxygenase inhibitors. Synthesis and biological activity of (methoxyalkyl)thiazole and methoxytetrahydropyran hybrids. J Med Chem 37:512-8 (1994)  
Target
Name:
Polyunsaturated fatty acid 5-lipoxygenase
Synonyms:
5-LO 5-Lipoxygenase (5-LO) 5-Lipoygenase ALOX5 LOG5 | LOX5_HUMAN
Type:
Enzyme
Mol. Mass.:
77972.74
Organism:
Homo sapiens (Human)
Description:
Recombinant protein was purified from E. coli lysate. After ammonium sulfate precipitation and subsequent steps, the supernatant (S100) was used for 5-LO activity assay.
Residue:
674
  
Inhibitor
Name:
BDBM50040422
Synonyms:
7-[3-(1-Methoxy-1-thiazol-2-yl-propyl)-phenoxymethyl]-4-phenyl-3H-naphtho[2,3-c]furan-1-one | CHEMBL151726
Type:
Small organic molecule
Emp. Form.:
C32H27NO4S
Mol. Mass.:
521.626
SMILES:
CCC(OC)(c1nccs1)c1cccc(OCc2ccc3c(c4COC(=O)c4cc3c2)-c2ccccc2)c1
: