Target
Phospholipase A2, membrane associated
Ligand
BDBM50040461
Substrate
Meas. Tech.
ChEMBL_156191 (CHEMBL761442)
IC50
21±n/a nM
Citation
 Beaton, HGBennion, CConnolly, SCook, ARGensmantel, NPHallam, CHardy, KHitchin, BJackson, CGRobinson, DH Discovery of new non-phospholipid inhibitors of the secretory phospholipases A2. J Med Chem 37:557-9 (1994)  
Target
Name:
Phospholipase A2, membrane associated
Synonyms:
GIIC sPLA2 NPS-PLA2 Non-pancreatic secretory phospholipase A2 (hnps-PLA2) PLA2B PLA2L Phospholipase A2 group IIA | RASF-A
Type:
Hydrolase
Mol. Mass.:
16101.20
Organism:
Homo sapiens (Human)
Description:
The human nps PLA2 was cloned, and expressed in E. coli. There was a refolding process in the purification.
Residue:
144
  
Inhibitor
Name:
BDBM50040461
Synonyms:
(S)-5-(4-Benzyl-phenylsulfanyl)-4-((S)-7-phenyl-heptanoylamino)-pentanoic acid CHEMBL434630
Type:
Small organic molecule
Emp. Form.:
C31H37NO3S
Mol. Mass.:
503.695
SMILES:
OC(=O)CC[C@@H](CSc1ccc(Cc2ccccc2)cc1)NC(=O)CCCCCCc1ccccc1
: