Target
Acetylcholinesterase
Ligand
BDBM50040622
Substrate
Meas. Tech.
ChEMBL_29095 (CHEMBL636833)
IC50
2±n/a nM
Citation
 Vidaluc, JLCalmel, FBigg, DCarilla, EStenger, AChopin, PBriley, M Novel [2-(4-piperidinyl)ethyl](thio)ureas: synthesis and antiacetylcholinesterase activity. J Med Chem 37:689-95 (1994)  
Target
Name:
Acetylcholinesterase
Synonyms:
ACES_RAT Acetylcholinesterase and butyrylcholinesterase (AChE and BChE) Acetylcholinesterase, AChE | Ache
Type:
Enzyme
Mol. Mass.:
68193.62
Organism:
Rattus norvegicus (rat)
Description:
P37136
Residue:
614
  
Inhibitor
Name:
BDBM50040622
Synonyms:
1-[2-(1-Benzyl-piperidin-4-yl)-ethyl]-3-(9,10-dioxo-9,10-dihydro-anthracene-2-carbonyl)-thiourea | CHEMBL159351
Type:
Small organic molecule
Emp. Form.:
C30H29N3O3S
Mol. Mass.:
511.635
SMILES:
O=C(NC(=S)NCCC1CCN(Cc2ccccc2)CC1)c1ccc2C(=O)c3ccccc3C(=O)c2c1
: