Target
Thymidylate synthase
Ligand
BDBM50040857
Substrate
Meas. Tech.
ChEMBL_209643 (CHEMBL811584)
Ki
0.09±n/a nM
Citation
 Pendergast, WDickerson, SHDev, IKFerone, RDuch, DSSmith, GK Benzo[f]quinazoline inhibitors of thymidylate synthase: methyleneamino-linked aroylglutamate derivatives. J Med Chem 37:838-44 (1994)  
Target
Name:
Thymidylate synthase
Synonyms:
TS TYMS Thymidylate synthase (TS) | Thymidylate synthase/GAR transformylase/AICAR transformylase
Type:
Enzyme
Mol. Mass.:
35718.07
Organism:
Homo sapiens (Human)
Description:
Residue:
313
  
Inhibitor
Name:
BDBM50040857
Synonyms:
(S)-2-{2-Fluoro-4-[(3-methyl-1-oxo-1,2-dihydro-benzo[f]quinazolin-9-ylmethyl)-amino]-benzoylamino}-pentanedioic acid TCMDC-138112
Type:
Small organic molecule
Emp. Form.:
C26H23FN4O6
Mol. Mass.:
506.4824
SMILES:
Cc1nc2ccc3ccc(CNc4ccc(C(=O)N[C@@H](CCC(O)=O)C(O)=O)c(F)c4)cc3c2c(=O)[nH]1
: