Target
Thymidylate synthase
Ligand
BDBM50040858
Substrate
Meas. Tech.
ChEMBL_209643 (CHEMBL811584)
Ki
5.5±n/a nM
Citation
 Pendergast, WDickerson, SHDev, IKFerone, RDuch, DSSmith, GK Benzo[f]quinazoline inhibitors of thymidylate synthase: methyleneamino-linked aroylglutamate derivatives. J Med Chem 37:838-44 (1994)  
Target
Name:
Thymidylate synthase
Synonyms:
TS TYMS Thymidylate synthase (TS) | Thymidylate synthase/GAR transformylase/AICAR transformylase
Type:
Enzyme
Mol. Mass.:
35718.07
Organism:
Homo sapiens (Human)
Description:
Residue:
313
  
Inhibitor
Name:
BDBM50040858
Synonyms:
(S)-2-[4-(3-Methyl-1-oxo-1,2-dihydro-benzo[f]quinazoline-9-sulfonylamino)-benzoylamino]-pentanedioic acid CHEMBL324739
Type:
Small organic molecule
Emp. Form.:
C25H22N4O8S
Mol. Mass.:
538.529
SMILES:
Cc1nc2ccc3ccc(cc3c2c(=O)[nH]1)S(=O)(=O)Nc1ccc(cc1)C(=O)N[C@@H](CCC(O)=O)C(O)=O
: