Target
Thymidylate synthase
Ligand
BDBM50040862
Substrate
Meas. Tech.
ChEMBL_209643 (CHEMBL811584)
Ki
4±n/a nM
Citation
 Pendergast, WDickerson, SHDev, IKFerone, RDuch, DSSmith, GK Benzo[f]quinazoline inhibitors of thymidylate synthase: methyleneamino-linked aroylglutamate derivatives. J Med Chem 37:838-44 (1994)  
Target
Name:
Thymidylate synthase
Synonyms:
TS TYMS Thymidylate synthase (TS) | Thymidylate synthase/GAR transformylase/AICAR transformylase
Type:
Enzyme
Mol. Mass.:
35718.07
Organism:
Homo sapiens (Human)
Description:
Residue:
313
  
Inhibitor
Name:
BDBM50040862
Synonyms:
(S)-2-{6-[(3-Methyl-1-oxo-1,2-dihydro-benzo[f]quinazolin-9-ylmethyl)-amino]-3-oxo-3H-benzo[d]isothiazol-2-yl}-pentanedioic acid | CHEMBL167164
Type:
Small organic molecule
Emp. Form.:
C26H22N4O6S
Mol. Mass.:
518.541
SMILES:
Cc1nc2ccc3ccc(CNc4ccc5c(c4)sn([C@@H](CCC(O)=O)C(O)=O)c5=O)cc3c2c(=O)[nH]1
: