Target
cAMP-dependent protein kinase
Ligand
BDBM2583
Substrate
Meas. Tech.
ChEMBL_152945 (CHEMBL874643)
IC50
200000±n/a nM
Citation
 Trinks, UBuchdunger, EFuret, PKump, WMett, HMeyer, TMüller, MRegenass, URihs, GLydon, N Dianilinophthalimides: potent and selective, ATP-competitive inhibitors of the EGF-receptor protein tyrosine kinase. J Med Chem 37:1015-27 (1994)  
Target
Name:
cAMP-dependent protein kinase
Synonyms:
Cyclic AMP-dependent protein kinase (PKA) Serine/threonine-protein kinase | cAMP-dependent protein kinase alpha-catalytic subunit
Type:
Enzyme
Mol. Mass.:
40766.33
Organism:
Oryctolagus cuniculus (Rabbit)
Description:
Q95J97
Residue:
351
  
Inhibitor
Name:
BDBM2583
Synonyms:
3,4-Bis(3-indolyl)-1H-pyrrole-2,5-dione BIM-4 Bisindolylmaleimide deriv. 5 bis-indolylmaleimide deriv. 8a
Type:
Small organic molecule
Emp. Form.:
C20H13N3O2
Mol. Mass.:
327.3361
SMILES:
O=C1NC(=O)C(=C1c1c[nH]c2ccccc12)c1c[nH]c2ccccc12
: