Target
Angiotensin-converting enzyme
Ligand
BDBM50041071
Substrate
Meas. Tech.
ChEMBL_36915 (CHEMBL647116)
IC50
32±n/a nM
Citation
 Fournié-Zaluski, MCCoric, PTurcaud, SRousselet, NGonzalez, WBarbe, BPham, IJullian, NMichel, JBRoques, BP New dual inhibitors of neutral endopeptidase and angiotensin-converting enzyme: rational design, bioavailability, and pharmacological responses in experimental hypertension. J Med Chem 37:1070-83 (1994)  
Target
Name:
Angiotensin-converting enzyme
Synonyms:
ACE_MOUSE Dcp1
Type:
PROTEIN
Mol. Mass.:
150916.88
Organism:
Mus musculus
Description:
ChEMBL_34763
Residue:
1312
  
Inhibitor
Name:
BDBM50041071
Synonyms:
(2-Mercaptomethyl-3-phenyl-butyrylamino)-acetic acid | CHEMBL273748
Type:
Small organic molecule
Emp. Form.:
C13H17NO3S
Mol. Mass.:
267.344
SMILES:
CC(C(CS)C(=O)NCC(O)=O)c1ccccc1
: